menu

Monitoring with Stackdriver on Kubernetes Engine

Go to Lab

1189 Reviews

avatar image

Error found in 'make create' for 'prometheus-service-sed.yaml' manifest google_container_cluster.primary (local-exec): error: unable to recognize "../manifests/prometheus-service-sed.yaml": no matches for kind "Deployment" in version "extensions/v1beta1" Error: Error running command 'kubectl -n default apply -f ../manifests/prometheus-service-sed.yaml': exit status 1. Output: service/prometheus created configmap/prometheus created error: unable to recognize "../manifests/prometheus-service-sed.yaml": no matches for kind "Deployment" in version "extensions/v1beta1" Makefile:26: recipe for target 'create' failed make: *** [create] Error 1

Rasis Syauqi B. · Reviewed about 8 hours ago

avatar image

Lab was not working. Got the error as google_container_cluster.primary: Still creating... [3m10s elapsed] google_container_cluster.primary (local-exec): clusterrole.rbac.authorization.k8s.io/prometheus created google_container_cluster.primary (local-exec): serviceaccount/prometheus created google_container_cluster.primary (local-exec): clusterrolebinding.rbac.authorization.k8s.io/prometheus-stackdriver created google_container_cluster.primary: Provisioning with 'local-exec'... google_container_cluster.primary (local-exec): Executing: ["/bin/sh" "-c" "kubectl -n default apply -f ../manifests/prometheus-service-sed.yaml"] google_container_cluster.primary (local-exec): service/prometheus created google_container_cluster.primary (local-exec): configmap/prometheus created google_container_cluster.primary (local-exec): error: unable to recognize "../manifests/prometheus-service-sed.yaml": no matches for kind "Deployment" in version "extensions/v1beta1" Error: Error running command 'kubectl -n default apply -f ../manifests/prometheus-service-sed.yaml': exit status 1. Output: service/prometheus created

Niran V. · Reviewed about 9 hours ago

avatar image

Rasis Syauqi B. · Reviewed about 9 hours ago

avatar image

Naoto K. · Reviewed about 13 hours ago

avatar image

Doyoub L. · Reviewed about 18 hours ago

avatar image

Doyoub L. · Reviewed about 20 hours ago

avatar image

Doyoub L. · Reviewed about 20 hours ago

avatar image

make create takes too long

Erick W. · Reviewed 1 day ago

avatar image

still get error of make crate

Jufianto H. · Reviewed 1 day ago

avatar image

Jufianto H. · Reviewed 1 day ago

avatar image

Code from github need to be renewed, because of misconfiguration for YAML manifest configuration

Christopher L. · Reviewed 1 day ago

avatar image

pending

jeremy j. · Reviewed 1 day ago

avatar image

Elmo A. · Reviewed 1 day ago

avatar image

chrisna d. · Reviewed 1 day ago

avatar image

chrisna d. · Reviewed 1 day ago

avatar image

Bayu Adi W. · Reviewed 1 day ago

avatar image

aditya r. · Reviewed 1 day ago

avatar image

Bintang L. · Reviewed 2 days ago

avatar image

There is an error said kind Deployment not found

Dipta L. · Reviewed 2 days ago

avatar image

Bintang L. · Reviewed 2 days ago

avatar image

Bintang L. · Reviewed 2 days ago

avatar image

Ricky I. · Reviewed 2 days ago

avatar image

Joko S. · Reviewed 2 days ago

avatar image

Ricky I. · Reviewed 2 days ago

avatar image

Lab was not working. Got the error as google_container_cluster.primary: Still creating... [3m10s elapsed] google_container_cluster.primary (local-exec): clusterrole.rbac.authorization.k8s.io/prometheus created google_container_cluster.primary (local-exec): serviceaccount/prometheus created google_container_cluster.primary (local-exec): clusterrolebinding.rbac.authorization.k8s.io/prometheus-stackdriver created google_container_cluster.primary: Provisioning with 'local-exec'... google_container_cluster.primary (local-exec): Executing: ["/bin/sh" "-c" "kubectl -n default apply -f ../manifests/prometheus-service-sed.yaml"] google_container_cluster.primary (local-exec): service/prometheus created google_container_cluster.primary (local-exec): configmap/prometheus created google_container_cluster.primary (local-exec): error: unable to recognize "../manifests/prometheus-service-sed.yaml": no matches for kind "Deployment" in version "extensions/v1beta1" Error: Error running command 'kubectl -n default apply -f ../manifests/prometheus-service-sed.yaml': exit status 1. Output: service/prometheus created

Niran V. · Reviewed 2 days ago