menu

Logging mit Stackdriver in Kubernetes Engine

Go to Lab

492 Reviews

Moises M. · Reviewed etwa 5 Stunden ago

Shouldn't make any assumptions here. It was long one.

Sushanth Bobby L. · Reviewed etwa 9 Stunden ago

Has issues in make create command

Sushanth Bobby L. · Reviewed etwa 9 Stunden ago

Sanket L. · Reviewed etwa 17 Stunden ago

Christian N. · Reviewed ein Tag ago

Unable to get the sinks to storage and BQ

Jose V. · Reviewed ein Tag ago

Paul R. · Reviewed ein Tag ago

Gabriel R. · Reviewed ein Tag ago

I could not do the lab because the shell does not work, the support team helped me by activating it through a virtual machine but I got a series of errors executing the commands through this machine

Gabriel R. · Reviewed 2 Tage ago

Swapnil P. · Reviewed 2 Tage ago

ok

Rodrigo M. · Reviewed 2 Tage ago

Attached terraform scripts don't work.

Hubert S. · Reviewed 2 Tage ago

Jocki H. · Reviewed 3 Tage ago

Sangeetha P. · Reviewed 3 Tage ago

Andreas H. · Reviewed 3 Tage ago

After fixing the two incidents of "zone =" in main.tf, replacing with "location =", it looked like the create script would succeed, but it still fails in the end with message: Error: Invalid template interpolation value: The expression result is null. Cannot include a null value in a string template.

Joar V. · Reviewed 4 Tage ago

There seems to be an error in main.tf Makefile:77: recipe for target 'check_trailing_whitespace' failed make: *** [check_trailing_whitespace] Error 1

Soo Tzer N. · Reviewed 4 Tage ago

There seems to be an error in main.tf Makefile:77: recipe for target 'check_trailing_whitespace' failed make: *** [check_trailing_whitespace] Error 1

Soo Tzer N. · Reviewed 4 Tage ago

selvaraj M. · Reviewed 11 Tage ago

Mauricio M. · Reviewed 11 Tage ago

Vijender K. · Reviewed 11 Tage ago

-- Update on 26th Nov Still getting the same error. Update after 3 days.. Still getting the error Getting Error changes, it is recommended to add version = "..." constraints to the corresponding provider blocks in configuration, with the constraint strings suggested below. * provider.google: version = "~> 3.0" * provider.random: version = "~> 2.2" Terraform has been successfully initialized! You may now begin working with Terraform. Try running "terraform plan" to see any changes that are required for your infrastructure. All Terraform commands should now work. If you ever set or change modules or backend configuration for Terraform, rerun this command to reinitialize your working directory. If you forget, other commands will detect it and remind you to do so if necessary. Error: "zone": [REMOVED] Use location instead on main.tf line 28, in data "google_container_engine_versions" "on-prem": 28: data "google_container_engine_versions" "on-prem" { Makefile:34: recipe for target 'create' failed make: *** [create] Error 1 student_00_527d32540a89@cloudshell:~/gke-logging-sinks-demo (qwiklabs-gcp-00-98e3de5b88b8)$ make create Your active configuration is: [cloudshell-13401] Your active configuration is: [cloudshell-13401] Your active configuration is: [cloudshell-13401] Operation "operations/acf.ad51466e-318f-4603-9b86-84619eda266a" finished successfully. Your active configuration is: [cloudshell-13401] Your active configuration is: [cloudshell-13401] Your active configuration is: [cloudshell-13401] /home/student_00_527d32540a89/gke-logging-sinks-demo/terraform/terraform.tfvars already exists. Please remove or rename before regenerating. Makefile:34: recipe for target 'create' failed make: *** [create] Error 1

Hemant G. · Reviewed 12 Tage ago

Juan Pablo C. · Reviewed 12 Tage ago

lab is broken, can I get my credits back?

Arnout C. · Reviewed 12 Tage ago

getting error Error: "zone": [REMOVED] Use location instead on main.tf line 28, in data "google_container_engine_versions" "on-prem": 28: data "google_container_engine_versions" "on-prem" { Makefile:34: recipe for target 'create' failed make: *** [create] Error 1

oumar o. · Reviewed 12 Tage ago